﻿element_type,div_size,section_header_size,section_header_title,section_header_title_position,section_header_title_color,section_header_subtitle,section_header_subtitle_position,section_header_subtitle_color,section_divider_type,sections,sections_slides,sections_size,sections_uniqid,sections_style,sections_placement,sections_type,sections_class,sections_clogic,sections_logic,sections_internal_name,radiobuttons_internal_name,radiobuttons_header_size,radiobuttons_header_title,radiobuttons_header_title_position,radiobuttons_header_title_color,radiobuttons_header_subtitle,radiobuttons_header_subtitle_position,radiobuttons_header_subtitle_color,radiobuttons_divider_type,radiobuttons_enabled,radiobuttons_required,radiobuttons_text_before_price,radiobuttons_text_after_price,radiobuttons_hide_amount,radiobuttons_quantity,radiobuttons_quantity_min,radiobuttons_quantity_max,radiobuttons_quantity_step,radiobuttons_quantity_default_value,radiobuttons_use_url,radiobuttons_use_images,radiobuttons_use_lightbox,radiobuttons_swatchmode,radiobuttons_use_colors,radiobuttons_changes_product_image,radiobuttons_items_per_row,radiobuttons_items_per_row_tablets,radiobuttons_items_per_row_tablets_small,radiobuttons_items_per_row_smartphones,radiobuttons_items_per_row_iphone5,radiobuttons_items_per_row_iphone6,radiobuttons_items_per_row_iphone6_plus,radiobuttons_items_per_row_samsung_galaxy,radiobuttons_items_per_row_tablets_galaxy,radiobuttons_clear_options,multiple_radiobuttons_options_title,multiple_radiobuttons_options_image,multiple_radiobuttons_options_imagec,multiple_radiobuttons_options_imagep,multiple_radiobuttons_options_imagel,multiple_radiobuttons_options_color,multiple_radiobuttons_options_value,multiple_radiobuttons_options_price,multiple_radiobuttons_options_sale_price,multiple_radiobuttons_options_price_type,multiple_radiobuttons_options_description,multiple_radiobuttons_options_weight,multiple_radiobuttons_options_url,radiobuttons_uniqid,radiobuttons_clogic,radiobuttons_logic,radiobuttons_class,radiobuttons_container_id,radiobuttons_include_tax_for_fee_price_type,radiobuttons_tax_class_for_fee_price_type,radiobuttons_hide_element_label_in_cart,radiobuttons_hide_element_value_in_cart,radiobuttons_hide_element_label_in_order,radiobuttons_hide_element_value_in_order,radiobuttons_hide_element_label_in_floatbox,radiobuttons_hide_element_value_in_floatbox,selectbox_internal_name,selectbox_header_size,selectbox_header_title,selectbox_header_title_position,selectbox_header_title_color,selectbox_header_subtitle,selectbox_header_subtitle_position,selectbox_header_subtitle_color,selectbox_divider_type,selectbox_enabled,selectbox_required,selectbox_text_before_price,selectbox_text_after_price,selectbox_price_type,selectbox_hide_amount,selectbox_quantity,selectbox_quantity_min,selectbox_quantity_max,selectbox_quantity_step,selectbox_quantity_default_value,selectbox_placeholder,selectbox_use_url,selectbox_changes_product_image,multiple_selectbox_options_title,multiple_selectbox_options_image,multiple_selectbox_options_imagec,multiple_selectbox_options_imagep,multiple_selectbox_options_imagel,multiple_selectbox_options_value,multiple_selectbox_options_price,multiple_selectbox_options_sale_price,multiple_selectbox_options_price_type,multiple_selectbox_options_description,multiple_selectbox_options_weight,multiple_selectbox_options_url,selectbox_uniqid,selectbox_clogic,selectbox_logic,selectbox_class,selectbox_container_id,selectbox_include_tax_for_fee_price_type,selectbox_tax_class_for_fee_price_type,selectbox_hide_element_label_in_cart,selectbox_hide_element_value_in_cart,selectbox_hide_element_label_in_order,selectbox_hide_element_value_in_order,selectbox_hide_element_label_in_floatbox,selectbox_hide_element_value_in_floatbox
"radiobuttons","w100","3","","","","","","","none","1","","w100","663af8ddd0d4b7.50452036","","before","","","{""toggle"":""show"",""what"":""any"",""rules"":[]}","","Section","Radio buttons","3","","","","","","","none","1","0","","","","","","","","","","","","","","","","","","","","","","","","","Flavor 1|Flavor 2|Flavor 3","||","||","||","||","||","Flavor 1|Flavor 2|Flavor 3","||","||","||","||","||","||","663af8ddd0d510.72960199","{""toggle"":""show"",""what"":""any"",""rules"":[]}","","","","","","","","","","","","Select Box","3","Options 1","","","","","","none","1","0","","","","","","","","","","","","","Option 1|Option 2|Option 3|Option 4","|||","|||","|||","|||","Option 1|Option 2|Option 3|Option 4","1|2|3|4","|||","|||","|||","|||","|||","663af8ddd0d574.92750097","{""element"":""663af8ddd0d574.92750097"",""toggle"":""show"",""what"":""all"",""rules"":[{""section"":""663af8ddd0d4b7.50452036"",""element"":""0"",""operator"":""is"",""value"":""Flavor%201""}]}","1","","","","","","","","","",""
"selectbox","w100","3","Select boxes","","","","","","none","3","","w100","663af8ddd0d4e3.43044629","","before","","","{""section"":""663af8ddd0d4e3.43044629"",""toggle"":""show"",""what"":""any"",""rules"":[{""section"":""663af8ddd0d4b7.50452036"",""element"":""0"",""operator"":""is"",""value"":""Flavor%201""},{""section"":""663af8ddd0d4b7.50452036"",""element"":""0"",""operator"":""is"",""value"":""Flavor%202""},{""section"":""663af8ddd0d4b7.50452036"",""element"":""0"",""operator"":""is"",""value"":""Flavor%203""}]}","1","Section","Radio buttons","3","Options 1","","","","","","none","1","0","","","","","","","","","","images","","","","images","3","","","","","","","","","","Option 1|Option 2|Option 3","http://epo.themecomplete.com/wp-content/uploads/sites/10/2013/06/cd_6_flat.jpg|http://epo.themecomplete.com/wp-content/uploads/sites/10/2013/06/cd_6_angle.jpg|http://epo.themecomplete.com/wp-content/uploads/sites/10/2013/06/cd_2_angle.jpg","||","||","||","||","Option 1|Option 2|Option 3","1|2|3","||","||","||","||","||","663af8ddd0d524.49128111","{""element"":""663af8ddd0d524.49128111"",""toggle"":""show"",""what"":""all"",""rules"":[{""section"":""663af8ddd0d4b7.50452036"",""element"":""0"",""operator"":""is"",""value"":""Flavor%201""}]}","1","","","","","","","","","","","Select Box","3","Options 2","","","","","","none","1","0","","","","","","","","","","","","","Option 1|Option 2|Option 3|Option 4","|||","|||","|||","|||","Option 1|Option 2|Option 3|Option 4","1|2|3|4","|||","|||","|||","|||","|||","663af8ddd0d587.12412559","{""element"":""663af8ddd0d587.12412559"",""toggle"":""show"",""what"":""all"",""rules"":[{""section"":""663af8ddd0d4b7.50452036"",""element"":""0"",""operator"":""is"",""value"":""Flavor%202""}]}","1","","","","","","","","","",""
"selectbox","w100","3","Radio buttons","","","","","","none","3","","w100","663af8ddd0d4f1.43195977","","before","","","{""section"":""663af8ddd0d4f1.43195977"",""toggle"":""show"",""what"":""any"",""rules"":[{""section"":""663af8ddd0d4b7.50452036"",""element"":""0"",""operator"":""is"",""value"":""Flavor%201""},{""section"":""663af8ddd0d4b7.50452036"",""element"":""0"",""operator"":""is"",""value"":""Flavor%202""},{""section"":""663af8ddd0d4b7.50452036"",""element"":""0"",""operator"":""is"",""value"":""Flavor%203""}]}","1","Section","Radio buttons","3","Options 2","","","","","","none","1","0","","","","","","","","","","images","","","","images","3","","","","","","","","","","Option 1|Option 2|Option 3","http://epo.themecomplete.com/wp-content/uploads/sites/10/2013/06/poster_5_up.jpg|http://epo.themecomplete.com/wp-content/uploads/sites/10/2013/06/poster_4_up.jpg|http://epo.themecomplete.com/wp-content/uploads/sites/10/2013/06/poster_3_up.jpg","||","||","||","||","Option 1|Option 2|Option 3","1|2|3","||","||","||","||","||","663af8ddd0d535.96532729","{""element"":""663af8ddd0d535.96532729"",""toggle"":""show"",""what"":""all"",""rules"":[{""section"":""663af8ddd0d4b7.50452036"",""element"":""0"",""operator"":""is"",""value"":""Flavor%202""}]}","1","","","","","","","","","","","Select Box","3","Options 3","","","","","","none","1","0","","","","","","","","","","","","","Option 1|Option 2|Option 3|Option 4","|||","|||","|||","|||","Option 1|Option 2|Option 3|Option 4","1|2|3|4","|||","|||","|||","|||","|||","663af8ddd0d599.99137483","{""element"":""663af8ddd0d599.99137483"",""toggle"":""show"",""what"":""all"",""rules"":[{""section"":""663af8ddd0d4b7.50452036"",""element"":""0"",""operator"":""is"",""value"":""Flavor%203""}]}","1","","","","","","","","","",""
"selectbox","w100","3","Radio buttons","","","","","","none","2","","w100","663af8ddd0d502.42817087","","before","","","{""section"":""663af8ddd0d502.42817087"",""toggle"":""show"",""what"":""all"",""rules"":[{""section"":""663af8ddd0d4b7.50452036"",""element"":""0"",""operator"":""is"",""value"":""Flavor%202""},{""section"":""663af8ddd0d4f1.43195977"",""element"":""1"",""operator"":""is"",""value"":""Option%202""}]}","1","Section","Radio buttons","3","Options 3","","","","","","none","1","0","","","","","","","","","","images","","","","images","3","","","","","","","","","","Option 1|Option 2|Option 3","http://epo.themecomplete.com/wp-content/uploads/sites/10/2013/06/hoodie_6_back.jpg|http://epo.themecomplete.com/wp-content/uploads/sites/10/2013/06/hoodie_2_back.jpg|http://epo.themecomplete.com/wp-content/uploads/sites/10/2013/06/hoodie_1_back.jpg","||","||","||","||","Option 1|Option 2|Option 3","1|2|3","||","||","||","||","||","663af8ddd0d540.95709945","{""element"":""663af8ddd0d540.95709945"",""toggle"":""show"",""what"":""all"",""rules"":[{""section"":""663af8ddd0d4b7.50452036"",""element"":""0"",""operator"":""is"",""value"":""Flavor%203""}]}","1","","","","","","","","","","",,,,,,,,,,,,,,,,,,,,,,,,,,,,,,,,,,,,,,,,,,,,,,,,
"radiobuttons","w100",,,,,,,,,,,,,,,,,,,,"Radio buttons","3","Options 2 Flavour 2","","","","","","none","1","0","","","","","","","","","","images","","","","images","3","","","","","","","","","","Option 1|Option 2|Option 3","http://epo.themecomplete.com/wp-content/uploads/sites/10/2013/06/cd_6_flat.jpg|http://epo.themecomplete.com/wp-content/uploads/sites/10/2013/06/cd_6_angle.jpg|http://epo.themecomplete.com/wp-content/uploads/sites/10/2013/06/cd_2_angle.jpg","||","||","||","||","Option 1|Option 2|Option 3","1|2|3","||","||","||","||","||","663af8ddd0d554.60304028","{""toggle"":""show"",""what"":""any"",""rules"":[]}","","","","","","","","","","","",,,,,,,,,,,,,,,,,,,,,,,,,,,,,,,,,,,,,,,,,,,,,,,,
"radiobuttons","w100",,,,,,,,,,,,,,,,,,,,"Radio buttons","3","Options 2 Flavour 2","","","","","","none","1","0","","","","","","","","","","images","","","","images","3","","","","","","","","","","Option 1|Option 2|Option 3","http://epo.themecomplete.com/wp-content/uploads/sites/10/2013/06/poster_5_up.jpg|http://epo.themecomplete.com/wp-content/uploads/sites/10/2013/06/poster_4_up.jpg|http://epo.themecomplete.com/wp-content/uploads/sites/10/2013/06/poster_3_up.jpg","||","||","||","||","Option 1|Option 2|Option 3","1|2|3","||","||","||","||","||","663af8ddd0d561.49487199","{""toggle"":""show"",""what"":""any"",""rules"":[]}","","","","","","","","","","","",,,,,,,,,,,,,,,,,,,,,,,,,,,,,,,,,,,,,,,,,,,,,,,,
"radiobuttons","w100",,,,,,,,,,,,,,,,,,,,,,,,,,,,,,,,,,,,,,,,,,,,,,,,,,,,,,,,,,,,,,,,,,,,,,,,,,,,,,,,,,,,,,,,,,,,,,,,,,,,,,,,,,,,,,,,,,,,,,,,,,,,,,,,
"radiobuttons","w100",,,,,,,,,,,,,,,,,,,,,,,,,,,,,,,,,,,,,,,,,,,,,,,,,,,,,,,,,,,,,,,,,,,,,,,,,,,,,,,,,,,,,,,,,,,,,,,,,,,,,,,,,,,,,,,,,,,,,,,,,,,,,,,,
"radiobuttons","w100",,,,,,,,,,,,,,,,,,,,,,,,,,,,,,,,,,,,,,,,,,,,,,,,,,,,,,,,,,,,,,,,,,,,,,,,,,,,,,,,,,,,,,,,,,,,,,,,,,,,,,,,,,,,,,,,,,,,,,,,,,,,,,,,
